{"text_format":"2","workbook":"xlsx","n_sheets":2,"sheets":["Information","Samleark"],"not_rendered":{"charts":0,"images":1,"macros":0,"external_links":0,"defined_names":0,"comments":1,"pivot_tables":0},"unopened":[],"bounds":{"document_bytes":16777216,"sheet_cells":100000,"run_cost":"one","rows_first":2000,"rows_last":500,"rows_between":2000,"halvings":0,"cell_chars":16384,"cell_head_chars":4096},"cells_cut":0,"cells_raw":0,"read":"whole","date_system":"1900"}

{"sheet":"Information","index":0,"n_rows":35,"n_cols":7,"rows_kept":35,"cut":false,"hidden":false,"merged":[[13,0,13,6],[5,0,5,6]]}
["Hvidovre Idrætsforening, Fodboldafdelingen",{"$nulls":5},"Godtgørelse 2018"]
[]
["Information 2018"]
[]
[]
["Ulønnede instruktører, trænere og ledere kan få skattefri omkostningsgodtgørelse for det arbejde, de udfører i deres forening. Skatterådet har justeret enkelte satser, for eksempel kørsel. De nye satser gælder pr. 1. 1. 2018."]
[]
[null,null,null,"Godtgørelse pr. år.",null,"Godtgørelse pr. mdr."]
["Telefonsamtaler og internetforbrug",null,null,2350,null,{"$f":"D9/12","v":195.83333333333334}]
["Administrative omkostninger",null,null,1400,null,{"$f":"D10/12","v":116.66666666666667}]
["Køb, vask og vedligeholdelse af tøj",null,null,1950,null,162.5]
["I alt ",null,null,{"$f":"SUM(D6:D11)","v":5700},"pr. år",475,"pr. mdr."]
[]
["Din forening kan udbetale befordringsgodtgørelse til personer, der udfører frivilligt arbejde i foreningen. Skatterådet har fastsat nye satser, som gælder pr. 1. 1. 2017:"]
[]
[null,"Km","Sats","Godtgørelse i alt"]
["De første 20.000 km.: ",20000,3.54,{"$f":"B17*C17","v":70800},"(2017: 3,53 kr.)"]
["Over 20.000 km.: ",null,1.94,null,"(2017: 1,93 kr.)"]
[]
["Kost ved arrangementer: ",null,70,"pr. dag. Arrangementet skal vare minimum 5 timer."]
[]
["Læs mere om godtgørelse på HIF hjemmeside",{"$nulls":4},"Her"]
[]
["Afdelinger","Afdelingsleder",null,null,"Hvem er omfattet "]
["Vælg Afdeling","-",null,null,"-"]
["Sportslig Ansvarlig","Jacob Kornerup",null,null,"Afdelingsledere"]
["Talentakademiet (U13A-19A + 2. Senior)","Christian Grønbæk",null,null,"(U13A-19A + 2. senior)"]
["Herre ungdom/-senior (U13-U19 + Senior og GM)","Lotte Christiansen",null,null,"(U13-U19 + Senior og GM)"]
["Drenge (U3-U12)","Jack Nilaus",null,null,"(U3-U12)"]
["Dame ungdom/-senior (U12-U19 + Senior og GM)","Lotte Christiansen",null,null,"(U12-U19 + Senior og GM)"]
["Piger (U3-U11)","Thomas Mogensen Wolfram",null,null,"(U3-U11)"]
[]
["Godkendelse"]
["Godtgørelsen skal være godkendt af din afdelingsleder",null,"JA"]
[null,null,"NEJ"]

{"sheet":"Samleark","index":1,"n_rows":36,"n_cols":7,"rows_kept":36,"cut":false,"hidden":false,"merged":[[11,2,11,4],[5,2,5,4],[6,2,6,4],[7,2,7,4],[8,2,8,4],[10,2,10,4],[31,1,31,2],[31,4,31,5],[33,1,33,2],[33,4,33,5],[13,2,13,4],[14,2,14,4],[15,2,15,4]]}
["Hvidovre Idrætsforening, Fodboldafdelingen",{"$nulls":5},"Godtgørelse 2018"]
[]
["Information"]
[]
[]
["Navn"]
["Adresse"]
["Cpr. nr."]
["Køretøjets reg.nr."]
[]
["Afdeling",null,"Vælg Afdeling"]
["Afdelingsleder",null,{"$f":"VLOOKUP(C11,Information!A25:C31,2,FALSE)","v":"-"}]
[]
["Afregningsperiode",null,"JUL 18 - DEC 18"]
["Mdr. aftalt godtgørelse",null,"Hvilken mdr. godtgørelse er aftalt"]
["Bank kontonummer til overførsel"]
[]
[]
["Standard jf. aftale"]
["Antal mdr. godtgørelsen dækker",null,null,6,"måneder"]
[]
[null,null,null,"Godtgøresle"]
["Telefonsamtaler og internetforbrug",null,null,{"$f":"Information!F9*D20","v":1175}]
["Administrative omkostninger",null,null,{"$f":"Information!F10*D20","v":700}]
["Køb, vask og vedligeholdelse af tøj",null,null,{"$f":"Information!F11*D20","v":975}]
["I alt ",null,null,{"$f":"SUM(D23:D25)","v":2850}]
[]
["Godtgørelse i alt",null,null,{"$f":"D26","v":2850}]
[]
[]
[]
["Udarbejdet af:",null,null,"Dato",null,null,"Navn"]
[]
["Godkendt af:",null,null,"Dato",null,null,"Navn"]
[]
[{"$nulls":4},"(Underskrift hvis ikke elektronisk)"]